Reaction Details
TargetVascular endothelial growth factor receptor 3
LigandBDBM50026612
Substrate/Competitorn/a
Meas. Tech.ChEMBL_1645070 (CHEMBL3993999)
IC50 3±n/a nM
Citation Qin, MYan, SWang, LZhang, HTian, YZhao, YGong, P Novel 6-methoxycarbonyl indolinones bearing a pyrrole Mannich base moiety as angiokinase inhibitors. Bioorg Med Chem25:1778-1786 (2017) 
 
Vascular endothelial growth factor receptor 3
Name:Vascular endothelial growth factor receptor 3
Type:Protein
Mol. Mass.:152749.58
Organism:Homo sapiens (Human)
Description:P35916-2
Residue:1363
BDBM50026612
NameBDBM50026612
Synonyms:BIBF-1120 US10981896, Compound Nintedanib US11208381, Nintedanib | Vargatef
TypeSmall organic molecule
Emp. Form.C31H33N5O4
Mol. Mass.539.6248
SMILESCOC(=O)c1ccc2\C(=C(\Nc3ccc(cc3)N(C)C(=O)CN3CCN(C)CC3)c3ccccc3)C(=O)Nc2c1