Reaction Details
TargetInduced myeloid leukemia cell differentiation protein Mcl-1
LigandBDBM50067354
Substrate/Competitorn/a
Meas. Tech.ChEMBL_1645329 (CHEMBL3994258)
Ki 440±n/a nM
Citation Liu, TWan, YLiu, RMa, LLi, MFang, H Design, synthesis and preliminary biological evaluation of indole-3-carboxylic acid-based skeleton of Bcl-2/Mcl-1 dual inhibitors. Bioorg Med Chem25:1939-1948 (2017) 
 
Induced myeloid leukemia cell differentiation protein Mcl-1
Name:Induced myeloid leukemia cell differentiation protein Mcl-1
Type:Membrane; Single-pass membrane protein
Mol. Mass.:37332.87
Organism:Homo sapiens (Human)
Description:Q07820
Residue:350
BDBM50067354
NameBDBM50067354
Synonyms:CHEMBL3401826
TypeSmall organic molecule
Emp. Form.C32H26N2O4S3
Mol. Mass.598.755
SMILESCc1ccc(cc1)S(=O)(=O)NC(=O)[C@H](Cc1ccccc1)N1C(=S)S\C(=C/c2ccc(cc2)-c2ccccc2)C1=O