Reaction Details
TargetCarbonic anhydrase 4
LigandBDBM50231532
Substrate/Competitorn/a
Meas. Tech.ChEMBL_1645380 (CHEMBL3994309)
Ki 8.9±n/a nM
Citation Krasavin, MKorsakov, MZvonaryova, ZSemyonychev, ETuccinardi, TKalinin, STanç, MSupuran, CT Human carbonic anhydrase inhibitory profile of mono- and bis-sulfonamides synthesized via a direct sulfochlorination of 3- and 4-(hetero)arylisoxazol-5-amine scaffolds. Bioorg Med Chem25:1914-1925 (2017) 
 
Carbonic anhydrase 4
Name:Carbonic anhydrase 4
Type:Enzyme
Mol. Mass.:35037.98
Organism:Homo sapiens (Human)
Description:P22748
Residue:312
BDBM50231532
NameBDBM50231532
Synonyms:CHEMBL4072247
TypeSmall organic molecule
Emp. Form.C10H12N4O5S2
Mol. Mass.332.356
SMILESCc1ccc(cc1S(N)(=O)=O)-c1noc(N)c1S(N)(=O)=O