Reaction Details
TargetSuccinate dehydrogenase [ubiquinone] iron-sulfur subunit, mitochondrial
LigandBDBM31068
Substrate/Competitorn/a
Meas. Tech.ChEMBL_1645572 (CHEMBL3994501)
EC50 749±n/a nM
Citation Li, LJiang, XHuang, SYing, ZZhang, ZPan, CLi, SWang, XZhang, Z Discovery of Highly Potent 2-Sulfonyl-Pyrimidinyl Derivatives for Apoptosis Inhibition and Ischemia Treatment. ACS Med Chem Lett8:407-412 (2017) 
 
Succinate dehydrogenase [ubiquinone] iron-sulfur subunit, mitochondrial
Name:Succinate dehydrogenase [ubiquinone] iron-sulfur subunit, mitochondrial
Type:PROTEIN
Mol. Mass.:31643.02
Organism:Homo sapiens (Human)
Description:ChEMBL_117429
Residue:280
BDBM31068
NameBDBM31068
Synonyms:2-(methylsulfonyl)-4-thien-2-yl-6-(trifluoromethyl)pyrimidine 2-methylsulfonyl-4-thiophen-2-yl-6-(trifluoromethyl)pyrimidine SMR000022589 cid_3245258
TypeSmall organic molecule
Emp. Form.C10H7F3N2O2S2
Mol. Mass.308.3
SMILESCS(=O)(=O)c1nc(cc(n1)C(F)(F)F)-c1cccs1