Reaction Details
TargetPolycomb protein EED
LigandBDBM50231836
Substrate/Competitorn/a
Meas. Tech.ChEMBL_1645614 (CHEMBL3994543)
IC50 40±n/a nM
Citation Baranczak, ATu, NPMarjanovic, JSearle, PAVasudevan, ADjuric, SW Integrated Platform for Expedited Synthesis-Purification-Testing of Small Molecule Libraries. ACS Med Chem Lett8:461-465 (2017) 
 
Polycomb protein EED
Name:Polycomb protein EED
Type:Protein
Mol. Mass.:50201.68
Organism:Homo sapiens (Human)
Description:O75530
Residue:441
BDBM50231836
NameBDBM50231836
Synonyms:CHEMBL4097336
TypeSmall organic molecule
Emp. Form.C26H36FN3
Mol. Mass.409.5825
SMILESCC1CCN(CC1)c1ccc(cc1)[C@H]1CN(Cc2c(C)cccc2F)C[C@@H]1N(C)C