Reaction Details
TargetPolyunsaturated fatty acid 5-lipoxygenase
LigandBDBM50232003
Substrate/Competitorn/a
Meas. Tech.ChEMBL_1645814 (CHEMBL3994870)
IC50 290±n/a nM
Citation Peduto, AScuotto, MKrauth, VRoviezzo, FRossi, ATemml, VEsposito, VStuppner, HSchuster, DD'Agostino, BSchiraldi, Cde Rosa, MWerz, OFilosa, R Optimization of benzoquinone and hydroquinone derivatives as potent inhibitors of human 5-lipoxygenase. Eur J Med Chem127:715-726 (2017) 
 
Polyunsaturated fatty acid 5-lipoxygenase
Name:Polyunsaturated fatty acid 5-lipoxygenase
Type:Enzyme
Mol. Mass.:77972.74
Organism:Homo sapiens (Human)
Description:Recombinant protein was purified from E. coli lysate. After ammonium sulfate precipitation and subsequent steps, the supernatant (S100) was used for 5-LO activity assay.
Residue:674
BDBM50232003
NameBDBM50232003
Synonyms:CHEMBL4061044
TypeSmall organic molecule
Emp. Form.C20H34O4
Mol. Mass.338.4816
SMILESCCCCCCCCCCCCCc1c(O)c(O)cc(OC)c1O