Reaction Details
TargetPoly [ADP-ribose] polymerase 2
LigandBDBM50232347
Substrate/Competitorn/a
Meas. Tech.ChEMBL_1646304 (CHEMBL3995360)
IC50 1000±n/a nM
Citation Thorsell, AGEkblad, TKarlberg, TLöw, MPinto, AFTrésaugues, LMoche, MCohen, MSSchüler, H Structural Basis for Potency and Promiscuity in Poly(ADP-ribose) Polymerase (PARP) and Tankyrase Inhibitors. J Med Chem60:1262-1271 (2017) 
 
Poly [ADP-ribose] polymerase 2
Name:Poly [ADP-ribose] polymerase 2
Type:Enzyme
Mol. Mass.:66225.70
Organism:Homo sapiens (Human)
Description:Q9UGN5
Residue:583
BDBM50232347
NameBDBM50232347
Synonyms:CHEMBL4089840
TypeSmall organic molecule
Emp. Form.C17H13NO3
Mol. Mass.279.29
SMILESO=C(COc1cccc2c1cc[nH]c2=O)c1ccccc1