Reaction Details
TargetProtein mono-ADP-ribosyltransferase PARP14
LigandBDBM50232347
Substrate/Competitorn/a
Meas. Tech.ChEBML_1646314
IC50 5754±n/a nM
Citation Thorsell, AGEkblad, TKarlberg, TLöw, MPinto, AFTrésaugues, LMoche, MCohen, MSSchüler, H Structural Basis for Potency and Promiscuity in Poly(ADP-ribose) Polymerase (PARP) and Tankyrase Inhibitors. J Med Chem60:1262-1271 (2017) 
 
Protein mono-ADP-ribosyltransferase PARP14
Name:Protein mono-ADP-ribosyltransferase PARP14
Type:n/a
Mol. Mass.:202812.41
Organism:Homo sapiens (Human)
Description:Q460N5
Residue:1801
BDBM50232347
NameBDBM50232347
Synonyms:CHEMBL4089840
TypeSmall organic molecule
Emp. Form.C17H13NO3
Mol. Mass.279.29
SMILESO=C(COc1cccc2c1cc[nH]c2=O)c1ccccc1