Reaction Details
TargetProtein mono-ADP-ribosyltransferase PARP12
LigandBDBM50316226
Substrate/Competitorn/a
Meas. Tech.ChEMBL_1646313 (CHEMBL3995369)
IC50 79±n/a nM
Citation Thorsell, AGEkblad, TKarlberg, TLöw, MPinto, AFTrésaugues, LMoche, MCohen, MSSchüler, H Structural Basis for Potency and Promiscuity in Poly(ADP-ribose) Polymerase (PARP) and Tankyrase Inhibitors. J Med Chem60:1262-1271 (2017) 
 
Protein mono-ADP-ribosyltransferase PARP12
Name:Protein mono-ADP-ribosyltransferase PARP12
Type:PROTEIN
Mol. Mass.:79092.00
Organism:Homo sapiens (Human)
Description:ChEMBL_107665
Residue:701
BDBM50316226
NameBDBM50316226
Synonyms:(S)-2-(4-(piperidin-3-yl)phenyl)-2H-indazole-7-carboxamide MK-4827 | Niraparib
TypeSmall organic molecule
Emp. Form.C19H20N4O
Mol. Mass.320.3883
SMILESNC(=O)c1cccc2cn(nc12)-c1ccc(cc1)[C@@H]1CCCNC1