Reaction Details
TargetProtein mono-ADP-ribosyltransferase PARP4
LigandBDBM27566
Substrate/Competitorn/a
Meas. Tech.ChEMBL_1646307 (CHEMBL3995363)
IC50 410±n/a nM
Citation Thorsell, AGEkblad, TKarlberg, TLöw, MPinto, AFTrésaugues, LMoche, MCohen, MSSchüler, H Structural Basis for Potency and Promiscuity in Poly(ADP-ribose) Polymerase (PARP) and Tankyrase Inhibitors. J Med Chem60:1262-1271 (2017) 
 
Protein mono-ADP-ribosyltransferase PARP4
Name:Protein mono-ADP-ribosyltransferase PARP4
Type:n/a
Mol. Mass.:192563.23
Organism:Homo sapiens (Human)
Description:Q9UKK3
Residue:1724
BDBM27566
NameBDBM27566
Synonyms:4-({3-[(4-cyclopropanecarbonylpiperazin-1-yl)carbonyl]-4-fluorophenyl}methyl)-1,2-dihydrophthalazin-1-one Olaparib US10597399, Compound AZD2281 US9255106, AZD2281
TypeSmall organic molecule
Emp. Form.C24H23FN4O3
Mol. Mass.434.4628
SMILESFc1ccc(Cc2n[nH]c(=O)c3ccccc23)cc1C(=O)N1CCN(CC1)C(=O)C1CC1