Reaction Details
TargetProtein mono-ADP-ribosyltransferase PARP3
LigandBDBM27135
Substrate/Competitorn/a
Meas. Tech.ChEMBL_1646306 (CHEMBL3995362)
IC50 2040±n/a nM
Citation Thorsell, AGEkblad, TKarlberg, TLöw, MPinto, AFTrésaugues, LMoche, MCohen, MSSchüler, H Structural Basis for Potency and Promiscuity in Poly(ADP-ribose) Polymerase (PARP) and Tankyrase Inhibitors. J Med Chem60:1262-1271 (2017) 
 
Protein mono-ADP-ribosyltransferase PARP3
Name:Protein mono-ADP-ribosyltransferase PARP3
Type:PROTEIN
Mol. Mass.:60091.40
Organism:Homo sapiens (Human)
Description:ChEMBL_109545
Residue:533
BDBM27135
NameBDBM27135
Synonyms:2-[(2R)-2-methylpyrrolidin-2-yl]-1H-1,3-benzodiazole-4-carboxamide benzimidazole carboxamide, 3a
TypeSmall organic molecule
Emp. Form.C13H16N4O
Mol. Mass.244.2923
SMILESC[C@@]1(CCCN1)c1nc2cccc(C(N)=O)c2[nH]1