Reaction Details
TargetProtein mono-ADP-ribosyltransferase PARP3
LigandBDBM50316226
Substrate/Competitorn/a
Meas. Tech.ChEMBL_1646306 (CHEMBL3995362)
IC50 296±n/a nM
Citation Thorsell, AGEkblad, TKarlberg, TLöw, MPinto, AFTrésaugues, LMoche, MCohen, MSSchüler, H Structural Basis for Potency and Promiscuity in Poly(ADP-ribose) Polymerase (PARP) and Tankyrase Inhibitors. J Med Chem60:1262-1271 (2017) 
 
Protein mono-ADP-ribosyltransferase PARP3
Name:Protein mono-ADP-ribosyltransferase PARP3
Type:PROTEIN
Mol. Mass.:60091.40
Organism:Homo sapiens (Human)
Description:ChEMBL_109545
Residue:533
BDBM50316226
NameBDBM50316226
Synonyms:(S)-2-(4-(piperidin-3-yl)phenyl)-2H-indazole-7-carboxamide MK-4827 | Niraparib
TypeSmall organic molecule
Emp. Form.C19H20N4O
Mol. Mass.320.3883
SMILESNC(=O)c1cccc2cn(nc12)-c1ccc(cc1)[C@@H]1CCCNC1