Reaction Details
TargetProtein mono-ADP-ribosyltransferase PARP16
LigandBDBM50145156
Substrate/Competitorn/a
Meas. Tech.ChEMBL_1646316 (CHEMBL3995372)
IC50 1900±n/a nM
Citation Thorsell, AGEkblad, TKarlberg, TLöw, MPinto, AFTrésaugues, LMoche, MCohen, MSSchüler, H Structural Basis for Potency and Promiscuity in Poly(ADP-ribose) Polymerase (PARP) and Tankyrase Inhibitors. J Med Chem60:1262-1271 (2017) 
 
Protein mono-ADP-ribosyltransferase PARP16
Name:Protein mono-ADP-ribosyltransferase PARP16
Type:PROTEIN
Mol. Mass.:36398.93
Organism:Homo sapiens (Human)
Description:ChEMBL_117586
Residue:322
BDBM50145156
NameBDBM50145156
Synonyms:CHEMBL3764816
TypeSmall organic molecule
Emp. Form.C19H14F2N6O
Mol. Mass.380.3509
SMILESCn1ncnc1[C@H]1[C@@H](Nc2cc(F)cc3c2c1n[nH]c3=O)c1ccc(F)cc1