Reaction Details
TargetProtein mono-ADP-ribosyltransferase PARP14
LigandBDBM50232346
Substrate/Competitorn/a
Meas. Tech.ChEMBL_1646314 (CHEMBL3995370)
IC50 3400±n/a nM
Citation Thorsell, AGEkblad, TKarlberg, TLöw, MPinto, AFTrésaugues, LMoche, MCohen, MSSchüler, H Structural Basis for Potency and Promiscuity in Poly(ADP-ribose) Polymerase (PARP) and Tankyrase Inhibitors. J Med Chem60:1262-1271 (2017) 
 
Protein mono-ADP-ribosyltransferase PARP14
Name:Protein mono-ADP-ribosyltransferase PARP14
Type:n/a
Mol. Mass.:202812.41
Organism:Homo sapiens (Human)
Description:Q460N5
Residue:1801
BDBM50232346
NameBDBM50232346
Synonyms:CHEMBL4101890
TypeSmall organic molecule
Emp. Form.C25H28N6O
Mol. Mass.428.5294
SMILESC[C@H]1CN(C[C@@H](C)N1)c1cc(C)c(cn1)-c1ccc(cc1)-c1nc2n(C)ccc2c(=O)[nH]1