Reaction Details
TargetProstaglandin F2-alpha receptor
LigandBDBM50232544
Substrate/Competitorn/a
Meas. Tech.ChEBML_1648064
Ki>6000±n/a nM
Citation Okumura, YYamagishi, TNukui, SNakao, K Discovery of AAT-008, a novel, potent, and selective prostaglandin EP4 receptor antagonist. Bioorg Med Chem Lett27:1186-1192 (2017) 
 
Prostaglandin F2-alpha receptor
Name:Prostaglandin F2-alpha receptor
Type:Enzyme
Mol. Mass.:40072.29
Organism:Homo sapiens (Human)
Description:P43088
Residue:359
BDBM50232544
NameBDBM50232544
Synonyms:CHEMBL4099851
TypeSmall organic molecule
Emp. Form.C21H16ClFN2O4
Mol. Mass.414.814
SMILESC[C@H](NC(=O)c1cc(Cl)cnc1Oc1cccc(F)c1)c1ccc(cc1)C(O)=O