Reaction Details
TargetCarbonic anhydrase 2
LigandBDBM26985
Substrate/Competitorn/a
Meas. Tech.ChEMBL_1648444 (CHEMBL3997500)
Ki 1500000±n/a nM
Citation Del Prete, SVullo, Ddi Fonzo, PCarginale, VSupuran, CTCapasso, C Comparison of the anion inhibition profiles of theß- and¿-carbonic anhydrases from the pathogenic bacterium Burkholderia pseudomallei. Bioorg Med Chem25:2010-2015 (2017) 
 
Carbonic anhydrase 2
Name:Carbonic anhydrase 2
Type:Enzyme
Mol. Mass.:29250.71
Organism:Homo sapiens (Human)
Description:P00918
Residue:260
BDBM26985
NameBDBM26985
Synonyms:2-triaza-1,2-diyne CHEMBL89295 azide
TypeIon
Emp. Form.N3
Mol. Mass.42.0206
SMILES[N-]=[N+]=[N-]