Reaction Details
TargetFibroblast growth factor receptor 2
LigandBDBM6190
Substrate/Competitorn/a
Meas. Tech.ChEMBL_1649192 (CHEMBL3998326)
IC50 5.0±n/a nM
Citation Cheng, WWang, MTian, XZhang, X An overview of the binding models of FGFR tyrosine kinases in complex with small molecule inhibitors. Eur J Med Chem126:476-490 (2017) 
 
Fibroblast growth factor receptor 2
Name:Fibroblast growth factor receptor 2
Type:Enzyme
Mol. Mass.:92015.45
Organism:Homo sapiens (Human)
Description:P21802
Residue:821
BDBM6190
NameBDBM6190
Synonyms:3-tert-butyl-1-(2-{[4-(diethylamino)butyl]amino}-6-(3,5-dimethoxyphenyl)pyrido[2,3-d]pyrimidin-7-yl)urea N-(tert-Butyl)-N -[2-[[4-(diethylamino)butyl]amino]-6-(3,5-dimethoxyphenyl)pyrido[2,3-d]pyrimidin-7-yl]urea | Pyrido[2,3-d]pyrimidine 12
TypeSmall organic molecule
Emp. Form.C28H41N7O3
Mol. Mass.523.6702
SMILESCCN(CC)CCCCNc1ncc2cc(c(NC(=O)NC(C)(C)C)nc2n1)-c1cc(OC)cc(OC)c1