Reaction Details
TargetCannabinoid receptor 2
LigandBDBM50232930
Substrate/Competitorn/a
Meas. Tech.ChEBML_1649599
Ki 2.6±n/a nM
Citation Ragusa, GGómez-Cañas, MMorales, PRodríguez-Cueto, CPazos, MRAsproni, BCichero, EFossa, PPinna, GAJagerovic, NFernández-Ruiz, JMurineddu, G New pyridazinone-4-carboxamides as new cannabinoid receptor type-2 inverse agonists: Synthesis, pharmacological data and molecular docking. Eur J Med Chem127:398-412 (2017) 
 
Cannabinoid receptor 2
Name:Cannabinoid receptor 2
Type:G Protein-Coupled Receptor (GPCR)
Mol. Mass.:39690.94
Organism:Homo sapiens (Human)
Description:P34972
Residue:360
BDBM50232930
NameBDBM50232930
Synonyms:CHEMBL4067246
TypeSmall organic molecule
Emp. Form.C29H31ClFN3O2
Mol. Mass.508.027
SMILES[H][C@@]12CC[C@@](C)(C1)[C@H](NC(=O)c1cc(nn(Cc3ccc(F)cc3)c1=O)-c1ccc(Cl)c(C)c1)C2(C)C