Reaction Details
TargetCannabinoid receptor 1
LigandBDBM50232941
Substrate/Competitorn/a
Meas. Tech.ChEMBL_1649598 (CHEMBL3998732)
Ki>4000±n/a nM
Citation Ragusa, GGómez-Cañas, MMorales, PRodríguez-Cueto, CPazos, MRAsproni, BCichero, EFossa, PPinna, GAJagerovic, NFernández-Ruiz, JMurineddu, G New pyridazinone-4-carboxamides as new cannabinoid receptor type-2 inverse agonists: Synthesis, pharmacological data and molecular docking. Eur J Med Chem127:398-412 (2017) 
 
Cannabinoid receptor 1
Name:Cannabinoid receptor 1
Type:G Protein-Coupled Receptor (GPCR)
Mol. Mass.:52868.96
Organism:Homo sapiens (Human)
Description:P21554
Residue:472
BDBM50232941
NameBDBM50232941
Synonyms:CHEMBL4084087
TypeSmall organic molecule
Emp. Form.C25H25ClFN3O2
Mol. Mass.453.936
SMILESCc1cc(ccc1Cl)-c1cc(C(=O)NC2CCCCC2)c(=O)n(Cc2ccc(F)cc2)n1