Reaction Details
TargetOrexin receptor type 2
LigandBDBM205107
Substrate/Competitorn/a
Meas. Tech.ChEMBL_1650583 (CHEMBL3999717)
Ki 3.1±n/a nM
Citation Skudlarek, JWDiMarco, CNBabaoglu, KRoecker, AJBruno, JGPausch, MAO'Brien, JACabalu, TDStevens, JBrunner, JTannenbaum, PLWuelfing, WPGarson, SLFox, SVSavitz, ATHarrell, CMGotter, ALWinrow, CJRenger, JJKuduk, SDColeman, PJ Investigation of orexin-2 selective receptor antagonists: Structural modifications resulting in dual orexin receptor antagonists. Bioorg Med Chem Lett27:1364-1370 (2017) 
 
Orexin receptor type 2
Name:Orexin receptor type 2
Type:Protein
Mol. Mass.:50710.53
Organism:Homo sapiens (Human)
Description:O43614
Residue:444
BDBM205107
NameBDBM205107
Synonyms:3-methyl-2-{[(3r,6r)-6- methyl-1-{[2- (trifluoromethyl)phenyl]carbonyl} piperidin-3- yl]oxy}pyridine-4-carbonitrile | US9546152, example 17
TypeSmall organic molecule
Emp. Form.C21H20F3N3O2
Mol. Mass.403.3976
SMILESC[C@@H]1CC[C@H](CN1C(=O)c1ccccc1C(F)(F)F)Oc1nccc(C#N)c1C