Reaction Details
TargetCarbonic anhydrase 1
LigandBDBM50233540
Substrate/Competitorn/a
Meas. Tech.ChEBML_1651002
Ki 8.5±n/a nM
Citation Boztas, MÇetinkaya, YTopal, MGülçin, IMenzek, ASahin, ETanc, MSupuran, CT Synthesis and carbonic anhydrase isoenzymes I, II, IX, and XII inhibitory effects of dimethoxybromophenol derivatives incorporating cyclopropane moieties. J Med Chem58:640-50 (2015) 
 
Carbonic anhydrase 1
Name:Carbonic anhydrase 1
Type:Enzyme
Mol. Mass.:28873.37
Organism:Homo sapiens (Human)
Description:P00915
Residue:261
BDBM50233540
NameBDBM50233540
Synonyms:CHEMBL4078936
TypeSmall organic molecule
Emp. Form.C13H18O3
Mol. Mass.222.2802
SMILESCOc1ccc(C[C@@H]2C[C@H]2CO)cc1OC