Reaction Details
TargetCarbonic anhydrase 1
LigandBDBM50233545
Substrate/Competitorn/a
Meas. Tech.ChEBML_1651002
Ki 3.2±n/a nM
Citation Boztas, MÇetinkaya, YTopal, MGülçin, IMenzek, ASahin, ETanc, MSupuran, CT Synthesis and carbonic anhydrase isoenzymes I, II, IX, and XII inhibitory effects of dimethoxybromophenol derivatives incorporating cyclopropane moieties. J Med Chem58:640-50 (2015) 
 
Carbonic anhydrase 1
Name:Carbonic anhydrase 1
Type:Enzyme
Mol. Mass.:28873.37
Organism:Homo sapiens (Human)
Description:P00915
Residue:261
BDBM50233545
NameBDBM50233545
Synonyms:CHEMBL4105642
TypeSmall organic molecule
Emp. Form.C15H17Br3O4
Mol. Mass.501.005
SMILESCCOC(=O)[C@@H]1C[C@@H]1Cc1c(Br)c(Br)c(OC)c(OC)c1Br