Reaction Details
TargetCarbonic anhydrase 2
LigandBDBM50233543
Substrate/Competitorn/a
Meas. Tech.ChEMBL_1651003 (CHEMBL4000258)
Ki 16±n/a nM
Citation Boztas, MÇetinkaya, YTopal, MGülçin, IMenzek, ASahin, ETanc, MSupuran, CT Synthesis and carbonic anhydrase isoenzymes I, II, IX, and XII inhibitory effects of dimethoxybromophenol derivatives incorporating cyclopropane moieties. J Med Chem58:640-50 (2015) 
 
Carbonic anhydrase 2
Name:Carbonic anhydrase 2
Type:Enzyme
Mol. Mass.:29250.71
Organism:Homo sapiens (Human)
Description:P00918
Residue:260
BDBM50233543
NameBDBM50233543
Synonyms:CHEMBL4089410
TypeSmall organic molecule
Emp. Form.C13H18O3
Mol. Mass.222.2802
SMILESCOc1ccc(C[C@H]2C[C@H]2CO)cc1OC