Reaction Details
TargetCarbonic anhydrase 1
LigandBDBM50233541
Substrate/Competitorn/a
Meas. Tech.ChEMBL_1651002 (CHEMBL4000257)
Ki 6.2±n/a nM
Citation Boztas, MÇetinkaya, YTopal, MGülçin, IMenzek, ASahin, ETanc, MSupuran, CT Synthesis and carbonic anhydrase isoenzymes I, II, IX, and XII inhibitory effects of dimethoxybromophenol derivatives incorporating cyclopropane moieties. J Med Chem58:640-50 (2015) 
 
Carbonic anhydrase 1
Name:Carbonic anhydrase 1
Type:Enzyme
Mol. Mass.:28873.37
Organism:Homo sapiens (Human)
Description:P00915
Residue:261
BDBM50233541
NameBDBM50233541
Synonyms:CHEMBL4103210
TypeSmall organic molecule
Emp. Form.C15H19BrO4
Mol. Mass.343.213
SMILESCCOC(=O)[C@@H]1C[C@@H]1Cc1cc(OC)c(OC)cc1Br