Reaction Details
TargetCarbonic anhydrase 2
LigandBDBM50233549
Substrate/Competitorn/a
Meas. Tech.ChEMBL_1651003 (CHEMBL4000258)
Ki 7.8±n/a nM
Citation Boztas, MÇetinkaya, YTopal, MGülçin, IMenzek, ASahin, ETanc, MSupuran, CT Synthesis and carbonic anhydrase isoenzymes I, II, IX, and XII inhibitory effects of dimethoxybromophenol derivatives incorporating cyclopropane moieties. J Med Chem58:640-50 (2015) 
 
Carbonic anhydrase 2
Name:Carbonic anhydrase 2
Type:Enzyme
Mol. Mass.:29250.71
Organism:Homo sapiens (Human)
Description:P00918
Residue:260
BDBM50233549
NameBDBM50233549
Synonyms:CHEMBL4092055
TypeSmall organic molecule
Emp. Form.C13H15BrO4
Mol. Mass.315.16
SMILESCOc1cc(Br)c(C[C@H]2C[C@H]2C(O)=O)cc1OC