Reaction Details
TargetCannabinoid receptor 2
LigandBDBM50233605
Substrate/Competitorn/a
Meas. Tech.ChEMBL_1651008 (CHEMBL4000263)
Ki 3.0±n/a nM
Citation Nikas, SPSharma, RParonis, CAKulkarni, SThakur, GAHurst, DWood, JTGifford, RSRajarshi, GLiu, YRaghav, JGGuo, JJJärbe, TUReggio, PHBergman, JMakriyannis, A Probing the carboxyester side chain in controlled deactivation (-)-d(8)-tetrahydrocannabinols. J Med Chem58:665-81 (2015) 
 
Cannabinoid receptor 2
Name:Cannabinoid receptor 2
Type:G Protein-Coupled Receptor (GPCR)
Mol. Mass.:39690.94
Organism:Homo sapiens (Human)
Description:P34972
Residue:360
BDBM50233605
NameBDBM50233605
Synonyms:CHEMBL3104362 | US10882838, Example 1.20
TypeSmall organic molecule
Emp. Form.C25H34O4
Mol. Mass.398.5351
SMILES[H][C@@]12CC(C)=CC[C@@]1([H])C(C)(C)Oc1cc(cc(O)c21)C1(CCC1)C(=O)OCCCC