Reaction Details
TargetCannabinoid receptor 1
LigandBDBM50233605
Substrate/Competitorn/a
Meas. Tech.ChEMBL_1651011 (CHEMBL4000266)
EC50 0.400000±n/a nM
Citation Nikas, SPSharma, RParonis, CAKulkarni, SThakur, GAHurst, DWood, JTGifford, RSRajarshi, GLiu, YRaghav, JGGuo, JJJärbe, TUReggio, PHBergman, JMakriyannis, A Probing the carboxyester side chain in controlled deactivation (-)-d(8)-tetrahydrocannabinols. J Med Chem58:665-81 (2015) 
 
Cannabinoid receptor 1
Name:Cannabinoid receptor 1
Type:G Protein-Coupled Receptor (GPCR)
Mol. Mass.:52856.55
Organism:Rattus norvegicus (rat)
Description:P20272
Residue:473
BDBM50233605
NameBDBM50233605
Synonyms:CHEMBL3104362 | US10882838, Example 1.20
TypeSmall organic molecule
Emp. Form.C25H34O4
Mol. Mass.398.5351
SMILES[H][C@@]12CC(C)=CC[C@@]1([H])C(C)(C)Oc1cc(cc(O)c21)C1(CCC1)C(=O)OCCCC