Reaction Details
TargetCannabinoid receptor 1
LigandBDBM50233599
Substrate/Competitorn/a
Meas. Tech.ChEMBL_1651011 (CHEMBL4000266)
EC50 0.500000±n/a nM
Citation Nikas, SPSharma, RParonis, CAKulkarni, SThakur, GAHurst, DWood, JTGifford, RSRajarshi, GLiu, YRaghav, JGGuo, JJJärbe, TUReggio, PHBergman, JMakriyannis, A Probing the carboxyester side chain in controlled deactivation (-)-d(8)-tetrahydrocannabinols. J Med Chem58:665-81 (2015) 
 
Cannabinoid receptor 1
Name:Cannabinoid receptor 1
Type:G Protein-Coupled Receptor (GPCR)
Mol. Mass.:52856.55
Organism:Rattus norvegicus (rat)
Description:P20272
Residue:473
BDBM50233599
NameBDBM50233599
Synonyms:CHEMBL3104360
TypeSmall organic molecule
Emp. Form.C24H34O4
Mol. Mass.386.5244
SMILES[H][C@@]12CC(C)=CC[C@@]1([H])C(C)(C)Oc1cc(cc(O)c21)C(C)(C)C(=O)OCCCC