Reaction Details
TargetCannabinoid receptor 2
LigandBDBM50233603
Substrate/Competitorn/a
Meas. Tech.ChEMBL_1651008 (CHEMBL4000263)
Ki 1.2±n/a nM
Citation Nikas, SPSharma, RParonis, CAKulkarni, SThakur, GAHurst, DWood, JTGifford, RSRajarshi, GLiu, YRaghav, JGGuo, JJJärbe, TUReggio, PHBergman, JMakriyannis, A Probing the carboxyester side chain in controlled deactivation (-)-d(8)-tetrahydrocannabinols. J Med Chem58:665-81 (2015) 
 
Cannabinoid receptor 2
Name:Cannabinoid receptor 2
Type:G Protein-Coupled Receptor (GPCR)
Mol. Mass.:39690.94
Organism:Homo sapiens (Human)
Description:P34972
Residue:360
BDBM50233603
NameBDBM50233603
Synonyms:CHEMBL4098489 | US10882838, Example 1.28
TypeSmall organic molecule
Emp. Form.C23H29NO4
Mol. Mass.383.4807
SMILES[H][C@@]12CC(C)=CC[C@@]1([H])C(C)(C)Oc1cc(CC(=O)OCCCCC#N)cc(O)c21