Reaction Details
TargetCannabinoid receptor 2
LigandBDBM50233602
Substrate/Competitorn/a
Meas. Tech.ChEMBL_1651007 (CHEMBL4000262)
Ki 0.800000±n/a nM
Citation Nikas, SPSharma, RParonis, CAKulkarni, SThakur, GAHurst, DWood, JTGifford, RSRajarshi, GLiu, YRaghav, JGGuo, JJJärbe, TUReggio, PHBergman, JMakriyannis, A Probing the carboxyester side chain in controlled deactivation (-)-d(8)-tetrahydrocannabinols. J Med Chem58:665-81 (2015) 
 
Cannabinoid receptor 2
Name:Cannabinoid receptor 2
Type:Enzyme Catalytic Domain
Mol. Mass.:38220.43
Organism:MOUSE
Description:P47936
Residue:347
BDBM50233602
NameBDBM50233602
Synonyms:CHEMBL4071389 | US10882838, Example 1.8
TypeSmall organic molecule
Emp. Form.C24H31NO4
Mol. Mass.397.5072
SMILES[H][C@@]12CC(C)=CC[C@@]1([H])C(C)(C)Oc1cc(cc(O)c21)C(C)(C)C(=O)OCCCC#N