Reaction Details
TargetCannabinoid receptor 2
LigandBDBM50233621
Substrate/Competitorn/a
Meas. Tech.ChEMBL_1651008 (CHEMBL4000263)
Ki 2.8±n/a nM
Citation Nikas, SPSharma, RParonis, CAKulkarni, SThakur, GAHurst, DWood, JTGifford, RSRajarshi, GLiu, YRaghav, JGGuo, JJJärbe, TUReggio, PHBergman, JMakriyannis, A Probing the carboxyester side chain in controlled deactivation (-)-d(8)-tetrahydrocannabinols. J Med Chem58:665-81 (2015) 
 
Cannabinoid receptor 2
Name:Cannabinoid receptor 2
Type:G Protein-Coupled Receptor (GPCR)
Mol. Mass.:39690.94
Organism:Homo sapiens (Human)
Description:P34972
Residue:360
BDBM50233621
NameBDBM50233621
Synonyms:CHEMBL4089791 | US10882838, Example 1.31
TypeSmall organic molecule
Emp. Form.C25H37NO3
Mol. Mass.399.5662
SMILES[H][C@@]12CC(C)=CC[C@@]1([H])C(C)(C)Oc1cc(cc(O)c21)C(C)(C)C(=O)NCCCCC