Reaction Details
TargetSigma non-opioid intracellular receptor 1
LigandBDBM50001043
Substrate/Competitorn/a
Meas. Tech.ChEMBL_1651358 (CHEMBL4000613)
Ki 3.9±n/a nM
Citation Prezzavento, OArena, ESánchez-Fernández, CTurnaturi, RParenti, CMarrazzo, ACatalano, RAmata, EPasquinucci, LCobos, EJ (+)-and (-)-Phenazocine enantiomers: Evaluation of their dual opioid agonist/s Eur J Med Chem125:603-610 (2017) 
 
Sigma non-opioid intracellular receptor 1
Name:Sigma non-opioid intracellular receptor 1
Type:Protein
Mol. Mass.:25307.17
Organism:Cavia porcellus (Guinea pig)
Description:Q60492
Residue:223
BDBM50001043
NameBDBM50001043
Synonyms:6,11-Dimethyl-3-phenethyl-1,2,3,4,5,6-hexahydro-2,6-methano-benzo[d]azocin-8-ol | CHEMBL94350
TypeSmall organic molecule
Emp. Form.C22H27NO
Mol. Mass.321.4559
SMILESC[C@@H]1[C@@H]2Cc3ccc(O)cc3[C@]1(C)CCN2CCc1ccccc1