Reaction Details
TargetEctonucleotide pyrophosphatase/phosphodiesterase family member 2
LigandBDBM50233909
Substrate/Competitorn/a
Meas. Tech.ChEMBL_1651766 (CHEMBL4001021)
IC50 33±n/a nM
Citation Miller, LMKeune, WJCastagna, DYoung, LCDuffy, ELPotjewyd, FSalgado-Polo, FEngel García, PSemaan, DPritchard, JMPerrakis, AMacdonald, SJJamieson, CWatson, AJ Structure-Activity Relationships of Small Molecule Autotaxin Inhibitors with a Discrete Binding Mode. J Med Chem60:722-748 (2017) 
 
Ectonucleotide pyrophosphatase/phosphodiesterase family member 2
Name:Ectonucleotide pyrophosphatase/phosphodiesterase family member 2
Type:Enzyme
Mol. Mass.:99007.13
Organism:Homo sapiens (Human)
Description:Q13822
Residue:863
BDBM50233909
NameBDBM50233909
Synonyms:CHEMBL4078251
TypeSmall organic molecule
Emp. Form.C21H18ClN3O2
Mol. Mass.379.84
SMILESCc1c(Cc2cccc(c2)C(O)=O)c2ccc(Cl)cc2n1-c1cnn(C)c1