Reaction Details
TargetEctonucleotide pyrophosphatase/phosphodiesterase family member 2
LigandBDBM50233915
Substrate/Competitorn/a
Meas. Tech.ChEMBL_1651776 (CHEMBL4001031)
IC50 2±n/a nM
Citation Miller, LMKeune, WJCastagna, DYoung, LCDuffy, ELPotjewyd, FSalgado-Polo, FEngel García, PSemaan, DPritchard, JMPerrakis, AMacdonald, SJJamieson, CWatson, AJ Structure-Activity Relationships of Small Molecule Autotaxin Inhibitors with a Discrete Binding Mode. J Med Chem60:722-748 (2017) 
 
Ectonucleotide pyrophosphatase/phosphodiesterase family member 2
Name:Ectonucleotide pyrophosphatase/phosphodiesterase family member 2
Type:Enzyme
Mol. Mass.:99007.13
Organism:Homo sapiens (Human)
Description:Q13822
Residue:863
BDBM50233915
NameBDBM50233915
Synonyms:CHEMBL4102874
TypeSmall organic molecule
Emp. Form.C28H20ClF2N2NaO3S
Mol. Mass.560.975
SMILES[Na+].Cc1c(Sc2cccc(C([O-])=O)c2F)c2ccc(Cl)c(F)c2n1CC(=O)N1CC2(CC2)c2ccccc12