Reaction Details
TargetMu-type opioid receptor
LigandBDBM50234129
Substrate/Competitorn/a
Meas. Tech.ChEMBL_1652216 (CHEMBL4001471)
Ki 313±n/a nM
Citation Healy, JRBezawada, PGriggs, NWDevereaux, ALMatsumoto, RRTraynor, JRCoop, ACunningham, CW Benzylideneoxymorphone: A new lead for development of bifunctional mu/delta opioid receptor ligands. Bioorg Med Chem Lett27:666-669 (2017) 
 
Mu-type opioid receptor
Name:Mu-type opioid receptor
Type:G Protein-Coupled Receptor (GPCR)
Mol. Mass.:44789.51
Organism:Homo sapiens (Human)
Description:P35372
Residue:400
BDBM50234129
NameBDBM50234129
Synonyms:CHEMBL4073537
TypeSmall organic molecule
Emp. Form.C32H31NO4
Mol. Mass.493.5928
SMILES[H][C@@]12Oc3c4c(C[C@@]5([H])N(CCCc6ccccc6)CC[C@@]14[C@@]5(O)C\C(=C/c1ccccc1)C2=O)ccc3O