Reaction Details
TargetKappa-type opioid receptor
LigandBDBM50234128
Substrate/Competitorn/a
Meas. Tech.ChEMBL_1652218 (CHEMBL4001473)
Ki 1067±n/a nM
Citation Healy, JRBezawada, PGriggs, NWDevereaux, ALMatsumoto, RRTraynor, JRCoop, ACunningham, CW Benzylideneoxymorphone: A new lead for development of bifunctional mu/delta opioid receptor ligands. Bioorg Med Chem Lett27:666-669 (2017) 
 
Kappa-type opioid receptor
Name:Kappa-type opioid receptor
Type:G Protein-Coupled Receptor (GPCR)
Mol. Mass.:42648.76
Organism:Homo sapiens (Human)
Description:P41145
Residue:380
BDBM50234128
NameBDBM50234128
Synonyms:CHEMBL4083911
TypeSmall organic molecule
Emp. Form.C24H23NO4
Mol. Mass.389.4437
SMILES[H][C@@]12Oc3c4c(C[C@@]5([H])N(C)CC[C@@]14[C@@]5(O)C\C(=C/c1ccccc1)C2=O)ccc3O