Reaction Details
TargetMu-type opioid receptor
LigandBDBM50234130
Substrate/Competitorn/a
Meas. Tech.ChEMBL_1652216 (CHEMBL4001471)
Ki 56±n/a nM
Citation Healy, JRBezawada, PGriggs, NWDevereaux, ALMatsumoto, RRTraynor, JRCoop, ACunningham, CW Benzylideneoxymorphone: A new lead for development of bifunctional mu/delta opioid receptor ligands. Bioorg Med Chem Lett27:666-669 (2017) 
 
Mu-type opioid receptor
Name:Mu-type opioid receptor
Type:G Protein-Coupled Receptor (GPCR)
Mol. Mass.:44789.51
Organism:Homo sapiens (Human)
Description:P35372
Residue:400
BDBM50234130
NameBDBM50234130
Synonyms:CHEMBL4094170
TypeSmall organic molecule
Emp. Form.C31H29NO4
Mol. Mass.479.5663
SMILES[H][C@@]12Oc3c4c(C[C@@]5([H])N(CCc6ccccc6)CC[C@@]14[C@@]5(O)C\C(=C/c1ccccc1)C2=O)ccc3O