Reaction Details
TargetCarbonic anhydrase 2
LigandBDBM10873
Substrate/Competitorn/a
Meas. Tech.ChEBML_1652371
Ki 30±n/a nM
Citation Del Prete, SVullo, DDi Fonzo, POsman, SMAlOthman, ZDonald, WASupuran, CTCapasso, C Sulfonamide inhibition profile of theż-carbonic anhydrase identified in the genome of the pathogenic bacterium Burkholderia pseudomallei the etiological agent responsible of melioidosis. Bioorg Med Chem Lett27:490-495 (2017) 
 
Carbonic anhydrase 2
Name:Carbonic anhydrase 2
Type:Enzyme
Mol. Mass.:29250.71
Organism:Homo sapiens (Human)
Description:P00918
Residue:260
BDBM10873
NameBDBM10873
Synonyms:4-[(2-aminopyrimidin-4-yl)amino]benzene-1-sulfonamide US9616064, Compound 1aa | aromatic/heteroaromatic sulfonamide 18
TypeSmall organic molecule
Emp. Form.C10H11N5O2S
Mol. Mass.265.292
SMILESNc1nccc(Nc2ccc(cc2)S(N)(=O)=O)n1