Reaction Details
TargetTryptophan 5-hydroxylase 1
LigandBDBM50234218
Substrate/Competitorn/a
Meas. Tech.ChEMBL_1652543 (CHEMBL4001798)
IC50 14±n/a nM
Citation Goldberg, DRDe Lombaert, SAiello, RBourassa, PBarucci, NZhang, QParalkar, VStein, AJHolt, MValentine, JZavadoski, W Optimization of spirocyclic proline tryptophan hydroxylase-1 inhibitors. Bioorg Med Chem Lett27:413-419 (2017) 
 
Tryptophan 5-hydroxylase 1
Name:Tryptophan 5-hydroxylase 1
Type:PROTEIN
Mol. Mass.:50990.64
Organism:Homo sapiens (Human)
Description:ChEMBL_1361824
Residue:444
BDBM50234218
NameBDBM50234218
Synonyms:CHEMBL4086156
TypeSmall organic molecule
Emp. Form.C28H29ClF3N5O5S
Mol. Mass.640.074
SMILESCS(=O)(=O)c1cccc(c1)-c1cc(Cl)ccc1[C@@H](Oc1cc(nc(N)n1)N1CCC2(CN[C@@H](C2)C(O)=O)CC1)C(F)(F)F