Reaction Details
TargetUbiquitin carboxyl-terminal hydrolase 7
LigandBDBM50234349
Substrate/Competitorn/a
Meas. Tech.ChEMBL_1652681 (CHEMBL4001936)
IC50>50000±n/a nM
Citation Chen, CSong, JWang, JXu, CChen, CGu, WSun, HWen, X Synthesis and biological evaluation of thiazole derivatives as novel USP7 inhibitors. Bioorg Med Chem Lett27:845-849 (2017) 
 
Ubiquitin carboxyl-terminal hydrolase 7
Name:Ubiquitin carboxyl-terminal hydrolase 7
Type:PROTEIN
Mol. Mass.:128274.45
Organism:Homo sapiens (Human)
Description:ChEMBL_1469483
Residue:1102
BDBM50234349
NameBDBM50234349
Synonyms:CHEMBL4059609
TypeSmall organic molecule
Emp. Form.C11H7Cl2NOS2
Mol. Mass.304.215
SMILESCC(=O)c1ncc(Sc2cccc(Cl)c2Cl)s1