Reaction Details
TargetUbiquitin carboxyl-terminal hydrolase 7
LigandBDBM50393440
Substrate/Competitorn/a
Meas. Tech.ChEMBL_1652681 (CHEMBL4001936)
IC50 19330±n/a nM
Citation Chen, CSong, JWang, JXu, CChen, CGu, WSun, HWen, X Synthesis and biological evaluation of thiazole derivatives as novel USP7 inhibitors. Bioorg Med Chem Lett27:845-849 (2017) 
 
Ubiquitin carboxyl-terminal hydrolase 7
Name:Ubiquitin carboxyl-terminal hydrolase 7
Type:PROTEIN
Mol. Mass.:128274.45
Organism:Homo sapiens (Human)
Description:ChEMBL_1469483
Residue:1102
BDBM50393440
NameBDBM50393440
Synonyms:CHEMBL2159498
TypeSmall organic molecule
Emp. Form.C12H7F2NO3S2
Mol. Mass.315.316
SMILESCC(=O)c1cc(c(Sc2ccc(F)cc2F)s1)[N+]([O-])=O