Reaction Details
TargetUbiquitin carboxyl-terminal hydrolase 7
LigandBDBM50234354
Substrate/Competitorn/a
Meas. Tech.ChEMBL_1652681 (CHEMBL4001936)
IC50>50000±n/a nM
Citation Chen, CSong, JWang, JXu, CChen, CGu, WSun, HWen, X Synthesis and biological evaluation of thiazole derivatives as novel USP7 inhibitors. Bioorg Med Chem Lett27:845-849 (2017) 
 
Ubiquitin carboxyl-terminal hydrolase 7
Name:Ubiquitin carboxyl-terminal hydrolase 7
Type:PROTEIN
Mol. Mass.:128274.45
Organism:Homo sapiens (Human)
Description:ChEMBL_1469483
Residue:1102
BDBM50234354
NameBDBM50234354
Synonyms:CHEMBL4085087
TypeSmall organic molecule
Emp. Form.C13H12N2O5S2
Mol. Mass.340.375
SMILESCOc1ccc(Sc2sc(nc2[N+]([O-])=O)C(C)=O)cc1OC