Reaction Details
TargetCorticotropin-releasing factor receptor 1
LigandBDBM50116105
Substrate/Competitorn/a
Meas. Tech.ChEMBL_1653072 (CHEMBL4002327)
IC50 67±n/a nM
Citation Mochizuki, MKojima, TKobayashi, KKotani, EIshichi, YKanzaki, NNakagawa, HOkuda, TKosugi, YYano, TSako, YTanaka, MAso, K Discovery of 4-chloro-2-(2,4-dichloro-6-methylphenoxy)-1-methyl-7-(pentan-3-yl)-1H-benzimidazole, a novel CRF Bioorg Med Chem25:1556-1570 (2017) 
 
Corticotropin-releasing factor receptor 1
Name:Corticotropin-releasing factor receptor 1
Type:Enzyme
Mol. Mass.:50744.31
Organism:Homo sapiens (Human)
Description:P34998
Residue:444
BDBM50116105
NameBDBM50116105
Synonyms:3-(6-(dimethylamino)-4-methylpyridin-3-yl)-2,5-dimethyl-N,N-dipropylpyrazolo[1,5-a]pyrimidin-7-amine R-121919 [3-(6-Dimethylamino-4-methyl-pyridin-3-yl)-2,5-dimethyl-pyrazolo[1,5-a]pyrimidin-7-yl]-dipropyl-amine
TypeSmall organic molecule
Emp. Form.C22H32N6
Mol. Mass.380.5297
SMILESCCCN(CCC)c1cc(C)nc2c(c(C)nn12)-c1cnc(cc1C)N(C)C