Reaction Details
TargetProtein Mdm4
LigandBDBM50234695
Substrate/Competitorn/a
Meas. Tech.ChEMBL_1653672 (CHEMBL4003038)
Ki 6990±n/a nM
Citation Surmiak, ENeochoritis, CGMusielak, BTwarda-Clapa, AKurpiewska, KDubin, GCamacho, CHolak, TADömling, A Rational design and synthesis of 1,5-disubstituted tetrazoles as potent inhibitors of the MDM2-p53 interaction. Eur J Med Chem126:384-407 (2017) 
 
Protein Mdm4
Name:Protein Mdm4
Type:Oncoprotein
Mol. Mass.:54842.04
Organism:Homo sapiens (Human)
Description:The HDMX(1-188) were expressed in Escherichia coli BL21 (DE3) as a GST fusion and purified on glutathione sepharose.
Residue:490
BDBM50234695
NameBDBM50234695
Synonyms:CHEMBL4065823
TypeSmall organic molecule
Emp. Form.C34H36ClFN6O3
Mol. Mass.631.139
SMILESCCOC(=O)c1[nH]c2cc(Cl)ccc2c1C(NCC1CCCCC1)c1nnnn1Cc1ccc(OCc2ccccc2F)cc1