Reaction Details
TargetCholinesterase
LigandBDBM50234769
Substrate/Competitorn/a
Meas. Tech.ChEMBL_1653859 (CHEMBL4003225)
IC50 1300±n/a nM
Citation Dgachi, YSokolov, OLuzet, VGodyn, JPanek, DBonet, AMartin, HIriepa, IMoraleda, IGarcía-Iriepa, CJanockova, JRichert, LSoukup, OMalawska, BChabchoub, FMarco-Contelles, JIsmaili, L Tetrahydropyranodiquinolin-8-amines as new, non hepatotoxic, antioxidant, and acetylcholinesterase inhibitors for Alzheimer's disease therapy. Eur J Med Chem126:576-589 (2017) 
 
Cholinesterase
Name:Cholinesterase
Type:Enzyme
Mol. Mass.:65643.35
Organism:Equus caballus (Horse)
Description:P81908
Residue:574
BDBM50234769
NameBDBM50234769
Synonyms:CHEMBL4095908
TypeSmall organic molecule
Emp. Form.C26H23N3O2
Mol. Mass.409.4797
SMILESCOc1cccc(c1)C1c2ccc3cccnc3c2Oc2nc3CCCCc3c(N)c12