Reaction Details
TargetAcetylcholinesterase
LigandBDBM50234769
Substrate/Competitorn/a
Meas. Tech.ChEMBL_1653860 (CHEMBL4003226)
Ki 870±n/a nM
Citation Dgachi, YSokolov, OLuzet, VGodyn, JPanek, DBonet, AMartin, HIriepa, IMoraleda, IGarcía-Iriepa, CJanockova, JRichert, LSoukup, OMalawska, BChabchoub, FMarco-Contelles, JIsmaili, L Tetrahydropyranodiquinolin-8-amines as new, non hepatotoxic, antioxidant, and acetylcholinesterase inhibitors for Alzheimer's disease therapy. Eur J Med Chem126:576-589 (2017) 
 
Acetylcholinesterase
Name:Acetylcholinesterase
Type:Enzyme
Mol. Mass.:67792.70
Organism:Homo sapiens (Human)
Description:P22303
Residue:614
BDBM50234769
NameBDBM50234769
Synonyms:CHEMBL4095908
TypeSmall organic molecule
Emp. Form.C26H23N3O2
Mol. Mass.409.4797
SMILESCOc1cccc(c1)C1c2ccc3cccnc3c2Oc2nc3CCCCc3c(N)c12