Reaction Details
TargetPoly [ADP-ribose] polymerase tankyrase-2
LigandBDBM50234916
Substrate/Competitorn/a
Meas. Tech.ChEMBL_1654156 (CHEMBL4003522)
IC50 0.200000±n/a nM
Citation Nathubhai, AHaikarainen, TKoivunen, JMurthy, SKoumanov, FLloyd, MDHolman, GDPihlajaniemi, TTosh, DLehtiö, LThreadgill, MD Highly Potent and Isoform Selective Dual Site Binding Tankyrase/Wnt Signaling Inhibitors That Increase Cellular Glucose Uptake and Have Antiproliferative Activity. J Med Chem60:814-820 (2017) 
 
Poly [ADP-ribose] polymerase tankyrase-2
Name:Poly [ADP-ribose] polymerase tankyrase-2
Type:Enzyme
Mol. Mass.:126937.16
Organism:Homo sapiens (Human)
Description:Q9H2K2
Residue:1166
BDBM50234916
NameBDBM50234916
Synonyms:CHEMBL4098188
TypeSmall organic molecule
Emp. Form.C27H21N5O3
Mol. Mass.463.4873
SMILESO=C(CCc1nc2ccccc2c(=O)[nH]1)Nc1ccc(cc1)C(=O)Nc1cccc2cccnc12