Reaction Details
TargetProtein mono-ADP-ribosyltransferase PARP15
LigandBDBM50234916
Substrate/Competitorn/a
Meas. Tech.ChEMBL_1654158 (CHEMBL4003524)
IC50>100000±n/a nM
Citation Nathubhai, AHaikarainen, TKoivunen, JMurthy, SKoumanov, FLloyd, MDHolman, GDPihlajaniemi, TTosh, DLehtiö, LThreadgill, MD Highly Potent and Isoform Selective Dual Site Binding Tankyrase/Wnt Signaling Inhibitors That Increase Cellular Glucose Uptake and Have Antiproliferative Activity. J Med Chem60:814-820 (2017) 
 
Protein mono-ADP-ribosyltransferase PARP15
Name:Protein mono-ADP-ribosyltransferase PARP15
Type:n/a
Mol. Mass.:74595.89
Organism:Homo sapiens (Human)
Description:Q460N3
Residue:678
BDBM50234916
NameBDBM50234916
Synonyms:CHEMBL4098188
TypeSmall organic molecule
Emp. Form.C27H21N5O3
Mol. Mass.463.4873
SMILESO=C(CCc1nc2ccccc2c(=O)[nH]1)Nc1ccc(cc1)C(=O)Nc1cccc2cccnc12