Reaction Details
TargetPoly [ADP-ribose] polymerase tankyrase-2
LigandBDBM50234919
Substrate/Competitorn/a
Meas. Tech.ChEMBL_1654156 (CHEMBL4003522)
IC50 31±n/a nM
Citation Nathubhai, AHaikarainen, TKoivunen, JMurthy, SKoumanov, FLloyd, MDHolman, GDPihlajaniemi, TTosh, DLehtiö, LThreadgill, MD Highly Potent and Isoform Selective Dual Site Binding Tankyrase/Wnt Signaling Inhibitors That Increase Cellular Glucose Uptake and Have Antiproliferative Activity. J Med Chem60:814-820 (2017) 
 
Poly [ADP-ribose] polymerase tankyrase-2
Name:Poly [ADP-ribose] polymerase tankyrase-2
Type:Enzyme
Mol. Mass.:126937.16
Organism:Homo sapiens (Human)
Description:Q9H2K2
Residue:1166
BDBM50234919
NameBDBM50234919
Synonyms:CHEMBL1956162
TypeSmall organic molecule
Emp. Form.C25H21N3O3
Mol. Mass.411.4525
SMILES[H][C@]12CC[C@]([H])(C1)[C@@]1([H])C(=O)N(C(=O)[C@@]21[H])c1ccc(cc1)C(=O)Nc1cccc2cccnc12