Reaction Details
TargetDual specificity protein kinase CLK4
LigandBDBM50235019
Substrate/Competitorn/a
Meas. Tech.ChEMBL_1654405 (CHEMBL4003771)
IC50 31±n/a nM
Citation Shi, YPark, JLagisetti, CZhou, WSambucetti, LCWebb, TR A triple exon-skipping luciferase reporter assay identifies a new CLK inhibitor pharmacophore. Bioorg Med Chem Lett27:406-412 (2017) 
 
Dual specificity protein kinase CLK4
Name:Dual specificity protein kinase CLK4
Type:Serine/threonine-protein kinase
Mol. Mass.:57522.53
Organism:Homo sapiens (Human)
Description:gi_10190706
Residue:481
BDBM50235019
NameBDBM50235019
Synonyms:CHEMBL4067013
TypeSmall organic molecule
Emp. Form.C22H29ClN8O
Mol. Mass.456.972
SMILESCC(C)n1cnc2c(Nc3cc(Cl)cc(NC(C)=O)c3)nc(N[C@H]3CCCC[C@H]3N)nc12